Reaction Details
TargetHistone deacetylase 11
LigandBDBM50020912
Substrate/Competitorn/a
Meas. Tech.ChEMBL_1455093 (CHEMBL3366349)
IC50 3.0±n/a nM
Citation Salvador, LAPark, HAl-Awadhi, FHLiu, YKim, BZeller, SLChen, QYHong, JLuesch, H Modulation of Activity Profiles for Largazole-Based HDAC Inhibitors through Alteration of Prodrug Properties. ACS Med Chem Lett5:905-10 (2014) 
 
Histone deacetylase 11
Name:Histone deacetylase 11
Type:Chromatin regulator; hydrolase; repressor
Mol. Mass.:39187.66
Organism:Homo sapiens (Human)
Description:Q96DB2
Residue:347
BDBM50020912
NameBDBM50020912
Synonyms:Largazole Thiol
TypeSmall organic molecule
Emp. Form.C21H28N4O4S3
Mol. Mass.496.666
SMILES[H][C@]1(CC(=O)NCc2nc(cs2)C2=N[C@@](C)(CS2)C(=O)N[C@H](C(C)C)C(=O)O1)\C=C\CCS