Reaction Details
TargetPolyamine deacetylase HDAC10
LigandBDBM50101330
Substrate/Competitorn/a
Meas. Tech.ChEMBL_1455103 (CHEMBL3366359)
IC50 0.500000±n/a nM
Citation Salvador, LAPark, HAl-Awadhi, FHLiu, YKim, BZeller, SLChen, QYHong, JLuesch, H Modulation of Activity Profiles for Largazole-Based HDAC Inhibitors through Alteration of Prodrug Properties. ACS Med Chem Lett5:905-10 (2014) 
 
Polyamine deacetylase HDAC10
Name:Polyamine deacetylase HDAC10
Type:Chromatin regulator; hydrolase; repressor
Mol. Mass.:71431.89
Organism:Homo sapiens (Human)
Description:Q969S8
Residue:669
BDBM50101330
NameBDBM50101330
Synonyms:CHEMBL3329622
TypeSmall organic molecule
Emp. Form.C33H49N5O8S4
Mol. Mass.772.031
SMILESCC(C)[C@@H]1NC(=O)[C@]2(C)CSC(=N2)c2csc(CNC(=O)C[C@H](OC1=O)\C=C\CCSSC[C@H](NC(=O)OC(C)(C)C)C(=O)OC(C)(C)C)n2