Reaction Details
TargetProto-oncogene tyrosine-protein kinase Src
LigandBDBM50102910
Substrate/Competitorn/a
Meas. Tech.ChEMBL_1461196 (CHEMBL3395759)
Ki 550±n/a nM
Citation Tintori, CFallacara, ALRadi, MZamperini, CDreassi, ECrespan, EMaga, GSchenone, SMusumeci, FBrullo, CRichters, AGasparrini, FAngelucci, AFestuccia, CDelle Monache, SRauh, DBotta, M Combining X-ray crystallography and molecular modeling toward the optimization of pyrazolo[3,4-d]pyrimidines as potent c-Src inhibitors active in vivo against neuroblastoma. J Med Chem58:347-61 (2015) 
 
Proto-oncogene tyrosine-protein kinase Src
Name:Proto-oncogene tyrosine-protein kinase Src
Type:Protein
Mol. Mass.:59838.60
Organism:Homo sapiens (Human)
Description:P12931
Residue:536
BDBM50102910
NameBDBM50102910
Synonyms:CHEMBL3394076
TypeSmall organic molecule
Emp. Form.C22H22ClN5S
Mol. Mass.423.962
SMILESCCSc1nc(Nc2cccc(Cl)c2)c2cnn(CC(C)c3ccccc3)c2n1