Reaction Details
TargetHistone chaperone ASF1A
LigandBDBM50101708
Substrate/Competitorn/a
Meas. Tech.ChEMBL_1462421 (CHEMBL3395843)
IC50 45000±n/a nM
Citation Miknis, GFStevens, SJSmith, LEOstrov, DAChurchill, ME Development of novel Asf1-H3/H4 inhibitors. Bioorg Med Chem Lett25:963-8 (2015) 
 
Histone chaperone ASF1A
Name:Histone chaperone ASF1A
Type:PROTEIN
Mol. Mass.:22950.75
Organism:Homo sapiens (Human)
Description:ChEMBL_109562
Residue:204
BDBM50101708
NameBDBM50101708
Synonyms:CHEMBL3394903
TypeSmall organic molecule
Emp. Form.C23H20BrN3O5
Mol. Mass.498.326
SMILESCOc1ccc(cc1)C(=O)Nc1ccc(cc1)C(=O)N\N=C\c1cc(Br)c(O)c(OC)c1