Reaction Details
TargetHistone chaperone ASF1A
LigandBDBM50101711
Substrate/Competitorn/a
Meas. Tech.ChEMBL_1462421 (CHEMBL3395843)
IC50>100000±n/a nM
Citation Miknis, GFStevens, SJSmith, LEOstrov, DAChurchill, ME Development of novel Asf1-H3/H4 inhibitors. Bioorg Med Chem Lett25:963-8 (2015) 
 
Histone chaperone ASF1A
Name:Histone chaperone ASF1A
Type:PROTEIN
Mol. Mass.:22950.75
Organism:Homo sapiens (Human)
Description:ChEMBL_109562
Residue:204
BDBM50101711
NameBDBM50101711
Synonyms:CHEMBL3394900
TypeSmall organic molecule
Emp. Form.C14H17BrN2O4
Mol. Mass.357.2
SMILESCOc1cc(\C=N\NC(=O)C2CCOCC2)cc(Br)c1O