Reaction Details
TargetHistone chaperone ASF1A
LigandBDBM50101739
Substrate/Competitorn/a
Meas. Tech.ChEMBL_1462421 (CHEMBL3395843)
IC50>100000±n/a nM
Citation Miknis, GFStevens, SJSmith, LEOstrov, DAChurchill, ME Development of novel Asf1-H3/H4 inhibitors. Bioorg Med Chem Lett25:963-8 (2015) 
 
Histone chaperone ASF1A
Name:Histone chaperone ASF1A
Type:PROTEIN
Mol. Mass.:22950.75
Organism:Homo sapiens (Human)
Description:ChEMBL_109562
Residue:204
BDBM50101739
NameBDBM50101739
Synonyms:CHEMBL3394898
TypeSmall organic molecule
Emp. Form.C14H12BrN3O3
Mol. Mass.350.167
SMILESCOc1cc(\C=N\NC(=O)c2ccncc2)cc(Br)c1O