Reaction Details
TargetHistone chaperone ASF1A
LigandBDBM50101746
Substrate/Competitorn/a
Meas. Tech.ChEMBL_1462421 (CHEMBL3395843)
IC50 32000±n/a nM
Citation Miknis, GFStevens, SJSmith, LEOstrov, DAChurchill, ME Development of novel Asf1-H3/H4 inhibitors. Bioorg Med Chem Lett25:963-8 (2015) 
 
Histone chaperone ASF1A
Name:Histone chaperone ASF1A
Type:PROTEIN
Mol. Mass.:22950.75
Organism:Homo sapiens (Human)
Description:ChEMBL_109562
Residue:204
BDBM50101746
NameBDBM50101746
Synonyms:CHEMBL3394891
TypeSmall organic molecule
Emp. Form.C17H15BrClN3O4
Mol. Mass.440.676
SMILESCOc1cc(\C=N\NC(=O)c2ccc(NC(=O)CCl)cc2)cc(Br)c1O