Reaction Details
TargetDNA-3-methyladenine glycosylase
LigandBDBM23223
Substrate/Competitorn/a
Meas. Tech.ChEMBL_1463504 (CHEMBL3398686)
IC50 3000±n/a nM
Citation Dixon, MWoodrick, JGupta, SKarmahapatra, SKDevito, SVasudevan, SDakshanamurthy, SAdhikari, SYenugonda, VMRoy, R Naturally occurring polyphenol, morin hydrate, inhibits enzymatic activity of N-methylpurine DNA glycosylase, a DNA repair enzyme with various roles in human disease. Bioorg Med Chem23:1102-11 (2015) 
 
DNA-3-methyladenine glycosylase
Name:DNA-3-methyladenine glycosylase
Type:PROTEIN
Mol. Mass.:32883.92
Organism:Homo sapiens (Human)
Description:ChEMBL_109564
Residue:298
BDBM23223
NameBDBM23223
Synonyms:7-[8-formyl-1,6,7-trihydroxy-3-methyl-5-(propan-2-yl)naphthalen-2-yl]-2,3,8-trihydroxy-6-methyl-4-(propan-2-yl)naphthalene-1-carbaldehyde Gossypol Gossypol, 4 Tash 1 cid_3503
TypeSmall organic molecule
Emp. Form.C30H30O8
Mol. Mass.518.5544
SMILESCC(C)c1c(O)c(O)c(C=O)c2c(O)c(c(C)cc12)-c1c(C)cc2c(C(C)C)c(O)c(O)c(C=O)c2c1O