Reaction Details
TargetDNA-3-methyladenine glycosylase
LigandBDBM67690
Substrate/Competitorn/a
Meas. Tech.ChEMBL_1463504 (CHEMBL3398686)
IC50 2500±n/a nM
Citation Dixon, MWoodrick, JGupta, SKarmahapatra, SKDevito, SVasudevan, SDakshanamurthy, SAdhikari, SYenugonda, VMRoy, R Naturally occurring polyphenol, morin hydrate, inhibits enzymatic activity of N-methylpurine DNA glycosylase, a DNA repair enzyme with various roles in human disease. Bioorg Med Chem23:1102-11 (2015) 
 
DNA-3-methyladenine glycosylase
Name:DNA-3-methyladenine glycosylase
Type:PROTEIN
Mol. Mass.:32883.92
Organism:Homo sapiens (Human)
Description:ChEMBL_109564
Residue:298
BDBM67690
NameBDBM67690
Synonyms:1,4-bis[2-(2-hydroxyethylamino)ethylamino]-5,8-bis(oxidanyl)anthracene-9,10-dione;hydrochloride 1,4-dihydroxy-5,8-bis[2-(2-hydroxyethylamino)ethylamino]anthracene-9,10-dione;hydrochloride MITOXANTRONE MLS001333711 cid_4212 | cid_5458171
TypeSmall organic molecule
Emp. Form.C22H28N4O6
Mol. Mass.444.4809
SMILESOCCNCCNc1ccc(NCCNCCO)c2C(=O)c3c(O)ccc(O)c3C(=O)c12