Reaction Details
TargetCytochrome P450 2A6
LigandBDBM50240772
Substrate/Competitorn/a
Meas. Tech.ChEMBL_1486542 (CHEMBL3532211)
Ki 130±n/a nM
Citation Stephens, ESWalsh, AAScott, EE Evaluation of inhibition selectivity for human cytochrome P450 2A enzymes. Drug Metab Dispos40:1797-802 (2012) 
 
Cytochrome P450 2A6
Name:Cytochrome P450 2A6
Type:Protein
Mol. Mass.:56514.34
Organism:Homo sapiens (Human)
Description:P11509
Residue:494
BDBM50240772
NameBDBM50240772
Synonyms:(1R,2S)-(-)-2-phenylcyclopropylamine (tranylcypromine)2-Phenyl-cyclopropylamine CHEMBL1179 TRANYLCYPROMINE US10836743, Compound TCP US9180183, Tranylcypromine rel-Tranylcypromine
TypeSmall organic molecule
Emp. Form.C9H11N
Mol. Mass.133.1903
SMILESN[C@@H]1C[C@H]1c1ccccc1