Reaction Details
TargetTyrosine-protein kinase JAK3
LigandBDBM50102646
Substrate/Competitorn/a
Meas. Tech.ChEMBL_1441460 (CHEMBL3374009)
IC50 10.0±n/a nM
Citation de Vicente, JLemoine, RBartlett, MHermann, JCHekmat-Nejad, MHenningsen, RJin, SKuglstatter, ALi, HLovey, AJMenke, JNiu, LPatel, VPetersen, ASetti, LShao, ATivitmahaisoon, PVu, MDSoth, M Scaffold hopping towards potent and selective JAK3 inhibitors: discovery of novel C-5 substituted pyrrolopyrazines. Bioorg Med Chem Lett24:4969-75 (2014) 
 
Tyrosine-protein kinase JAK3
Name:Tyrosine-protein kinase JAK3
Type:Protein
Mol. Mass.:125111.08
Organism:Homo sapiens (Human)
Description:P52333
Residue:1124
BDBM50102646
NameBDBM50102646
Synonyms:CHEMBL3335684
TypeSmall organic molecule
Emp. Form.C15H22N6O3S
Mol. Mass.366.439
SMILESCCCS(=O)(=O)N1CCC[C@@H](C1)NC(=O)Nc1cnc2[nH]ccc2n1