Reaction Details
TargetTyrosine-protein kinase JAK2
LigandBDBM112546
Substrate/Competitorn/a
Meas. Tech.ChEMBL_1441461 (CHEMBL3374010)
IC50 9.0±n/a nM
Citation de Vicente, JLemoine, RBartlett, MHermann, JCHekmat-Nejad, MHenningsen, RJin, SKuglstatter, ALi, HLovey, AJMenke, JNiu, LPatel, VPetersen, ASetti, LShao, ATivitmahaisoon, PVu, MDSoth, M Scaffold hopping towards potent and selective JAK3 inhibitors: discovery of novel C-5 substituted pyrrolopyrazines. Bioorg Med Chem Lett24:4969-75 (2014) 
 
Tyrosine-protein kinase JAK2
Name:Tyrosine-protein kinase JAK2
Type:Protein
Mol. Mass.:130684.68
Organism:Homo sapiens (Human)
Description:O60674
Residue:1132
BDBM112546
NameBDBM112546
Synonyms:US8618103, I-42
TypeSmall organic molecule
Emp. Form.C18H19N7O2S
Mol. Mass.397.454
SMILESO=S(=O)(CC#N)N1CCC[C@@H](C1)Nc1ncccc1-c1cnc2[nH]ccc2n1