Reaction Details
TargetTyrosine-protein kinase JAK3
LigandBDBM50102635
Substrate/Competitorn/a
Meas. Tech.ChEMBL_1441460 (CHEMBL3374009)
IC50 17±n/a nM
Citation de Vicente, JLemoine, RBartlett, MHermann, JCHekmat-Nejad, MHenningsen, RJin, SKuglstatter, ALi, HLovey, AJMenke, JNiu, LPatel, VPetersen, ASetti, LShao, ATivitmahaisoon, PVu, MDSoth, M Scaffold hopping towards potent and selective JAK3 inhibitors: discovery of novel C-5 substituted pyrrolopyrazines. Bioorg Med Chem Lett24:4969-75 (2014) 
 
Tyrosine-protein kinase JAK3
Name:Tyrosine-protein kinase JAK3
Type:Protein
Mol. Mass.:125111.08
Organism:Homo sapiens (Human)
Description:P52333
Residue:1124
BDBM50102635
NameBDBM50102635
Synonyms:CHEMBL3335695
TypeSmall organic molecule
Emp. Form.C16H19N7O3S
Mol. Mass.389.432
SMILESCS(=O)(=O)N1CCC[C@@H](C1)Nc1nc(O)ncc1-c1cnc2[nH]ccc2n1