Reaction Details
TargetNeutrophil collagenase
LigandBDBM11863
Substrate/Competitorn/a
Meas. Tech.ChEMBL_1431423 (CHEMBL3388712)
IC50 0.097000±n/a nM
Citation Nara, HSato, KNaito, TMototani, HOki, HYamamoto, YKuno, HSantou, TKanzaki, NTerauchi, JUchikawa, OKori, M Discovery of novel, highly potent, and selective quinazoline-2-carboxamide-based matrix metalloproteinase (MMP)-13 inhibitors without a zinc binding group using a structure-based design approach. J Med Chem57:8886-902 (2014) 
 
Neutrophil collagenase
Name:Neutrophil collagenase
Type:Enzyme
Mol. Mass.:53413.48
Organism:Homo sapiens (Human)
Description:P22894
Residue:467
BDBM11863
NameBDBM11863
Synonyms:4-({[4-(4-chlorophenoxy)benzene]sulfonyl}methyl)-N-hydroxyoxane-4-carboxamide RS 130830 alpha-tetrahydropyran beta-sulfone 1B
TypeSmall organic molecule
Emp. Form.C19H20ClNO6S
Mol. Mass.425.883
SMILESONC(=O)C1(CS(=O)(=O)c2ccc(Oc3ccc(Cl)cc3)cc2)CCOCC1