Reaction Details
TargetMatrilysin
LigandBDBM50102750
Substrate/Competitorn/a
Meas. Tech.ChEMBL_1431422 (CHEMBL3388711)
IC50>10000±n/a nM
Citation Nara, HSato, KNaito, TMototani, HOki, HYamamoto, YKuno, HSantou, TKanzaki, NTerauchi, JUchikawa, OKori, M Discovery of novel, highly potent, and selective quinazoline-2-carboxamide-based matrix metalloproteinase (MMP)-13 inhibitors without a zinc binding group using a structure-based design approach. J Med Chem57:8886-902 (2014) 
 
Matrilysin
Name:Matrilysin
Type:Enzyme
Mol. Mass.:29681.54
Organism:Homo sapiens (Human)
Description:P09237
Residue:267
BDBM50102750
NameBDBM50102750
Synonyms:CHEMBL3359091
TypeSmall organic molecule
Emp. Form.C26H22FN3O6
Mol. Mass.491.4678
SMILESCOc1cccc(CNC(=O)c2nc3ccc(F)c(OCCc4ccc(cc4)C(O)=O)c3c(=O)[nH]2)c1