Reaction Details
TargetDelta-type opioid receptor
LigandBDBM50325534
Substrate/Competitorn/a
Meas. Tech.ChEMBL_1432428 (CHEMBL3385710)
Ki 51±n/a nM
Citation Watanabe, YKitazawa, SFujii, HNemoto, THirayama, SIwai, TGouda, HHirono, SNagasea, H Design, synthesis, and structure-activity relationship of novel opioid¿ receptor selective agonists:a-iminoamide derivatives with an azabicyclo[2.2.2]octene skeleton. Bioorg Med Chem Lett24:4980-3 (2014) 
 
Delta-type opioid receptor
Name:Delta-type opioid receptor
Type:Enzyme Catalytic Domain
Mol. Mass.:40577.25
Organism:MOUSE
Description:P32300
Residue:372
BDBM50325534
NameBDBM50325534
Synonyms:CHEMBL267495 | nalfurafine
TypeSmall organic molecule
Emp. Form.C28H32N2O5
Mol. Mass.476.5641
SMILESCN([C@@H]1CC[C@@]2(O)[C@H]3Cc4ccc(O)c5O[C@@H]1[C@]2(CCN3CC1CC1)c45)C(=O)\C=C\c1ccoc1