Reaction Details
TargetKappa-type opioid receptor
LigandBDBM50102834
Substrate/Competitorn/a
Meas. Tech.ChEMBL_1432429 (CHEMBL3385711)
Ki 0.380000±n/a nM
Citation Watanabe, YKitazawa, SFujii, HNemoto, THirayama, SIwai, TGouda, HHirono, SNagasea, H Design, synthesis, and structure-activity relationship of novel opioid¿ receptor selective agonists:a-iminoamide derivatives with an azabicyclo[2.2.2]octene skeleton. Bioorg Med Chem Lett24:4980-3 (2014) 
 
Kappa-type opioid receptor
Name:Kappa-type opioid receptor
Type:G Protein-Coupled Receptor (GPCR)
Mol. Mass.:42744.99
Organism:Cavia porcellus (domestic guinea pig)
Description:P41144
Residue:380
BDBM50102834
NameBDBM50102834
Synonyms:CHEMBL3339377
TypeSmall organic molecule
Emp. Form.C28H29N3O4
Mol. Mass.471.5476
SMILESOc1ccc2CC3N(CC4CC4)CCC45C(Oc1c24)[C@@]1(O)CC[C@@]35N=C1C(=O)Nc1ccccc1