Reaction Details
TargetMu-type opioid receptor
LigandBDBM50102832
Substrate/Competitorn/a
Meas. Tech.ChEMBL_1432431 (CHEMBL3385713)
EC50 1.1±n/a nM
Citation Watanabe, YKitazawa, SFujii, HNemoto, THirayama, SIwai, TGouda, HHirono, SNagasea, H Design, synthesis, and structure-activity relationship of novel opioid¿ receptor selective agonists:a-iminoamide derivatives with an azabicyclo[2.2.2]octene skeleton. Bioorg Med Chem Lett24:4980-3 (2014) 
 
Mu-type opioid receptor
Name:Mu-type opioid receptor
Type:G Protein-Coupled Receptor (GPCR)
Mol. Mass.:44789.51
Organism:Homo sapiens (Human)
Description:P35372
Residue:400
BDBM50102832
NameBDBM50102832
Synonyms:CHEMBL3339379
TypeSmall organic molecule
Emp. Form.C30H33N3O4
Mol. Mass.499.6007
SMILESOc1ccc2CC3N(CC4CC4)CCC45C(Oc1c24)[C@@]1(O)CC[C@@]35N=C1C(=O)NCCc1ccccc1