Reaction Details
TargetNociceptin receptor
LigandBDBM50102836
Substrate/Competitorn/a
Meas. Tech.ChEMBL_1433281 (CHEMBL3389388)
Kd 1.2±n/a nM
Citation Inamine, SNishimura, HLi, JIsozaki, KMatsushima, ACosta, TShimohigashi, Y Tritium-labelled isovaleryl-RYYRIK-NH2 as potential antagonist probe for ORL1 nociceptin receptor. Bioorg Med Chem22:5902-9 (2014) 
 
Nociceptin receptor
Name:Nociceptin receptor
Type:G Protein-Coupled Receptor (GPCR)
Mol. Mass.:40702.87
Organism:Homo sapiens (Human)
Description:P41146
Residue:370
BDBM50102836
NameBDBM50102836
Synonyms:CHEMBL3343946
TypeSmall organic molecule
Emp. Form.C47H76N14O9
Mol. Mass.985.211
SMILES[3H]C(C(=O)N[C@@H](CCCNC(N)=N)C(=O)N[C@@H](Cc1ccc(O)cc1)C(=O)N[C@@H](Cc1ccc(O)cc1)C(=O)N[C@@H](CCCNC(N)=N)C(=O)N[C@@H]([C@@H](C)CC)C(=O)N[C@@H](CCCCN)C(N)=O)C([3H])(C)C