Reaction Details
TargetNociceptin receptor
LigandBDBM50004178
Substrate/Competitorn/a
Meas. Tech.ChEMBL_1433281 (CHEMBL3389388)
Kd 0.190000±n/a nM
Citation Inamine, SNishimura, HLi, JIsozaki, KMatsushima, ACosta, TShimohigashi, Y Tritium-labelled isovaleryl-RYYRIK-NH2 as potential antagonist probe for ORL1 nociceptin receptor. Bioorg Med Chem22:5902-9 (2014) 
 
Nociceptin receptor
Name:Nociceptin receptor
Type:G Protein-Coupled Receptor (GPCR)
Mol. Mass.:40702.87
Organism:Homo sapiens (Human)
Description:P41146
Residue:370
BDBM50004178
NameBDBM50004178
Synonyms:Nociceptin ORPHANIN FQ
TypeSmall organic molecule
Emp. Form.C79H129N27O22
Mol. Mass.1809.0373
SMILESCC(C)C[C@H](NC(=O)[C@H](CCCCN)NC(=O)[C@H](CCCNC(N)=N)NC(=O)[C@H](C)NC(=O)[C@H](CO)NC(=O)[C@H](CCCCN)NC(=O)[C@H](CCCNC(N)=N)NC(=O)[C@H](C)NC(=O)CNC(=O)[C@@H](NC(=O)[C@H](Cc1ccccc1)NC(=O)CNC(=O)CNC(=O)[C@@H](N)Cc1ccccc1)[C@@H](C)O)C(=O)N[C@@H](C)C(=O)N[C@@H](CC(N)=O)C(=O)N[C@@H](CCC(N)=O)C(O)=O