Reaction Details
TargetMitogen-activated protein kinase 10
LigandBDBM50103004
Substrate/Competitorn/a
Meas. Tech.ChEMBL_1461214 (CHEMBL3395777)
IC50 12±n/a nM
Citation Muth, FGünther, MBauer, SMDöring, EFischer, SMaier, JDrückes, PKöppler, JTrappe, JRothbauer, UKoch, PLaufer, SA Tetra-substituted pyridinylimidazoles as dual inhibitors of p38a mitogen-activated protein kinase and c-Jun N-terminal kinase 3 for potential treatment of neurodegenerative diseases. J Med Chem58:443-56 (2015) 
 
Mitogen-activated protein kinase 10
Name:Mitogen-activated protein kinase 10
Type:Enzyme
Mol. Mass.:52586.89
Organism:Homo sapiens (Human)
Description:n/a
Residue:464
BDBM50103004
NameBDBM50103004
Synonyms:CHEMBL3394120
TypeSmall organic molecule
Emp. Form.C24H25FN4O4S
Mol. Mass.484.543
SMILESCOC(Cn1c(S\C=C/C(O)=O)nc(c1-c1ccnc(NC2CC2)c1)-c1ccc(F)cc1)OC