Reaction Details
TargetProthrombin
LigandBDBM50103200
Substrate/Competitorn/a
Meas. Tech.ChEMBL_1461142 (CHEMBL3395467)
Ki>12610±n/a nM
Citation Corte, JRFang, THangeland, JJFriends, TJRendina, ARLuettgen, JMBozarth, JMBarbera, FARossi, KAWei, ARamamurthy, VMorin, PESeiffert, DAWexler, RRQuan, ML Pyridine and pyridinone-based factor XIa inhibitors. Bioorg Med Chem Lett25:925-30 (2015) 
 
Prothrombin
Name:Prothrombin
Type:Protein
Mol. Mass.:70029.57
Organism:Homo sapiens (Human)
Description:P00734
Residue:622
BDBM50103200
NameBDBM50103200
Synonyms:CHEMBL3393386
TypeSmall organic molecule
Emp. Form.C28H32N6O
Mol. Mass.468.5933
SMILESNC[C@H]1CC[C@@H](CC1)C(=O)N[C@@H](Cc1ccccc1)c1cc(ccn1)-c1ccc2c(N)n[nH]c2c1