Reaction Details
TargetVitamin K-dependent protein C
LigandBDBM50103200
Substrate/Competitorn/a
Meas. Tech.ChEMBL_1461145 (CHEMBL3395470)
Ki>21400±n/a nM
Citation Corte, JRFang, THangeland, JJFriends, TJRendina, ARLuettgen, JMBozarth, JMBarbera, FARossi, KAWei, ARamamurthy, VMorin, PESeiffert, DAWexler, RRQuan, ML Pyridine and pyridinone-based factor XIa inhibitors. Bioorg Med Chem Lett25:925-30 (2015) 
 
Vitamin K-dependent protein C
Name:Vitamin K-dependent protein C
Type:Enzyme
Mol. Mass.:52067.73
Organism:Homo sapiens (Human)
Description:n/a
Residue:461
BDBM50103200
NameBDBM50103200
Synonyms:CHEMBL3393386
TypeSmall organic molecule
Emp. Form.C28H32N6O
Mol. Mass.468.5933
SMILESNC[C@H]1CC[C@@H](CC1)C(=O)N[C@@H](Cc1ccccc1)c1cc(ccn1)-c1ccc2c(N)n[nH]c2c1