Reaction Details
TargetTrypanothione reductase
LigandBDBM50103370
Substrate/Competitorn/a
Meas. Tech.ChEMBL_1463623 (CHEMBL3398941)
Ki 27900±n/a nM
Citation O'Sullivan, MCDurham, TBValdes, HEDauer, KLKarney, NJForrestel, ACBacchi, CJBaker, JF Dibenzosuberyl substituted polyamines and analogs of clomipramine as effective inhibitors of trypanothione reductase; molecular docking, and assessment of trypanocidal activities. Bioorg Med Chem23:996-1010 (2015) 
 
Trypanothione reductase
Name:Trypanothione reductase
Type:Homodimer; oxidoreductase
Mol. Mass.:53868.26
Organism:Trypanosoma cruzi
Description:n/a
Residue:492
BDBM50103370
NameBDBM50103370
Synonyms:CHEMBL3398187
TypeSmall organic molecule
Emp. Form.C18H24N4
Mol. Mass.296.41
SMILESNCCN(CCN)C1c2ccccc2CCc2cccnc12