Reaction Details
TargetUDP-glucuronosyltransferase 1-6
LigandBDBM50103451
Substrate/Competitorn/a
Meas. Tech.ChEMBL_1462520 (CHEMBL3399065)
IC50>300000±n/a nM
Citation Nair, VOkello, MOMangu, NKSeo, BIGund, MG A novel molecule with notable activity against multi-drug resistant tuberculosis. Bioorg Med Chem Lett25:1269-73 (2015) 
 
UDP-glucuronosyltransferase 1-6
Name:UDP-glucuronosyltransferase 1-6
Type:Enzyme
Mol. Mass.:60765.14
Organism:Homo sapiens (Human)
Description:P19224
Residue:532
BDBM50103451
NameBDBM50103451
Synonyms:CHEMBL3398252
TypeSmall organic molecule
Emp. Form.C37H31F3N4O4
Mol. Mass.652.6616
SMILESO\C(=C/C(=O)c1cc(Cc2cc(F)cc(F)c2)cn(Cc2ccccc2F)c1=O)C(=O)N1CCN(CC1)c1ccc(cc1)-n1cccc1