Reaction Details
TargetBromodomain-containing protein 4
LigandBDBM50380682
Substrate/Competitorn/a
Meas. Tech.ChEMBL_1462564 (CHEMBL3399181)
IC50 107±n/a nM
Citation Noguchi-Yachide, TSakai, THashimoto, YYamaguchi, T Discovery and structure-activity relationship studies of N6-benzoyladenine derivatives as novel BRD4 inhibitors. Bioorg Med Chem23:953-9 (2015) 
 
Bromodomain-containing protein 4
Name:Bromodomain-containing protein 4
Type:Protein
Mol. Mass.:152264.84
Organism:Homo sapiens (Human)
Description:O60885
Residue:1362
BDBM50380682
NameBDBM50380682
Synonyms:CHEMBL2017291 | I-BET151 (16)
TypeSmall organic molecule
Emp. Form.C23H21N5O3
Mol. Mass.415.4445
SMILESCOc1cc2c3n([C@H](C)c4ccccn4)c(=O)[nH]c3cnc2cc1-c1c(C)noc1C