Reaction Details
TargetCytochrome P450 3A4
LigandBDBM50030448
Substrate/Competitorn/a
Meas. Tech.ChEMBL_1485690 (CHEMBL3541082)
IC50 620±n/a nM
Citation Amundsen, RÅsberg, AOhm, IKChristensen, H Cyclosporine A- and tacrolimus-mediated inhibition of CYP3A4 and CYP3A5 in vitro. Drug Metab Dispos40:655-61 (2012) 
 
Cytochrome P450 3A4
Name:Cytochrome P450 3A4
Type:Enzyme
Mol. Mass.:57349.57
Organism:Homo sapiens (Human)
Description:n/a
Residue:503
BDBM50030448
NameBDBM50030448
Synonyms:8-DEETHYL-8-[BUT-3-ENYL]-ASCOMYCIN TACROLIMUS
TypeSmall organic molecule
Emp. Form.C44H69NO12
Mol. Mass.804.0182
SMILESCO[C@@H]1C[C@@H](CC[C@H]1O)\C=C(/C)[C@H]1OC(=O)[C@@H]2CCCCN2C(=O)C(=O)[C@]2(O)O[C@@H]([C@H](C[C@H]2C)OC)[C@H](C[C@@H](C)C\C(C)=C\[C@@H](CC=C)C(=O)C[C@H](O)[C@H]1C)OC