Reaction Details
TargetSolute carrier family 22 member 8
LigandBDBM50103522
Substrate/Competitorn/a
Meas. Tech.ChEMBL_1482571 (CHEMBL3537392)
IC50 233000±n/a nM
Citation Wolman, ATGionfriddo, MRHeindel, GAMukhija, PWitkowski, SBommareddy, AVanwert, AL Organic anion transporter 3 interacts selectively with lipophilicß-lactam antibiotics. Drug Metab Dispos41:791-800 (2013) 
 
Solute carrier family 22 member 8
Name:Solute carrier family 22 member 8
Type:PROTEIN
Mol. Mass.:59254.18
Organism:Mus musculus
Description:ChEMBL_104613
Residue:537
BDBM50103522
NameBDBM50103522
Synonyms:BRL-2288 Tarcil Ticarcillin Ticarpen
TypeSmall organic molecule
Emp. Form.C15H16N2O6S2
Mol. Mass.384.427
SMILES[H][C@]12SC(C)(C)[C@@H](N1C(=O)[C@H]2NC(=O)[C@H](C(O)=O)c1ccsc1)C(O)=O