Reaction Details
TargetSolute carrier family 22 member 8
LigandBDBM50103524
Substrate/Competitorn/a
Meas. Tech.ChEMBL_1482571 (CHEMBL3537392)
IC50 35700±n/a nM
Citation Wolman, ATGionfriddo, MRHeindel, GAMukhija, PWitkowski, SBommareddy, AVanwert, AL Organic anion transporter 3 interacts selectively with lipophilicß-lactam antibiotics. Drug Metab Dispos41:791-800 (2013) 
 
Solute carrier family 22 member 8
Name:Solute carrier family 22 member 8
Type:PROTEIN
Mol. Mass.:59254.18
Organism:Mus musculus
Description:ChEMBL_104613
Residue:537
BDBM50103524
NameBDBM50103524
Synonyms:Ceftiofur
TypeSmall organic molecule
Emp. Form.C19H17N5O7S3
Mol. Mass.523.563
SMILES[H][C@]12SCC(CSC(=O)c3ccco3)=C(N1C(=O)[C@H]2NC(=O)C(=N/OC)\c1csc(N)n1)C(O)=O