Reaction Details
TargetSolute carrier family 22 member 8
LigandBDBM50206509
Substrate/Competitorn/a
Meas. Tech.ChEMBL_1482571 (CHEMBL3537392)
IC50 3020±n/a nM
Citation Wolman, ATGionfriddo, MRHeindel, GAMukhija, PWitkowski, SBommareddy, AVanwert, AL Organic anion transporter 3 interacts selectively with lipophilicß-lactam antibiotics. Drug Metab Dispos41:791-800 (2013) 
 
Solute carrier family 22 member 8
Name:Solute carrier family 22 member 8
Type:PROTEIN
Mol. Mass.:59254.18
Organism:Mus musculus
Description:ChEMBL_104613
Residue:537
BDBM50206509
NameBDBM50206509
Synonyms:4-Dipropylsulfamoyl-benzoic acid 4-Dipropylsulfamoyl-benzoic acid(probenecid) CHEMBL897 Probalan
TypeSmall organic molecule
Emp. Form.C13H19NO4S
Mol. Mass.285.359
SMILESCCCN(CCC)S(=O)(=O)c1ccc(cc1)C(O)=O