Reaction Details
TargetCytochrome P450 2D6
LigandBDBM50070208
Substrate/Competitorn/a
Meas. Tech.ChEMBL_1487308 (CHEMBL3534775)
IC50 2900±n/a nM
Citation Lee, CAJones, JPKatayama, JKaspera, RJiang, YFreiwald, SSmith, EWalker, GSTotah, RA Identifying a selective substrate and inhibitor pair for the evaluation of CYP2J2 activity. Drug Metab Dispos40:943-51 (2012) 
 
Cytochrome P450 2D6
Name:Cytochrome P450 2D6
Type:Protein
Mol. Mass.:55774.82
Organism:Homo sapiens (Human)
Description:P10635
Residue:497
BDBM50070208
NameBDBM50070208
Synonyms:A-65006 CHEBI:6375 Prevacid Prevacid Delayed Release Prevacid iv
TypeSmall organic molecule
Emp. Form.C16H14F3N3O2S
Mol. Mass.369.361
SMILESCc1c(OCC(F)(F)F)ccnc1C[S+]([O-])c1nc2ccccc2[nH]1