Reaction Details
TargetCytochrome P450 2D6
LigandBDBM50423541
Substrate/Competitorn/a
Meas. Tech.ChEMBL_1487308 (CHEMBL3534775)
IC50 2740±n/a nM
Citation Lee, CAJones, JPKatayama, JKaspera, RJiang, YFreiwald, SSmith, EWalker, GSTotah, RA Identifying a selective substrate and inhibitor pair for the evaluation of CYP2J2 activity. Drug Metab Dispos40:943-51 (2012) 
 
Cytochrome P450 2D6
Name:Cytochrome P450 2D6
Type:Protein
Mol. Mass.:55774.82
Organism:Homo sapiens (Human)
Description:P10635
Residue:497
BDBM50423541
NameBDBM50423541
Synonyms:DANAZOL WIN-17757
TypeSmall organic molecule
Emp. Form.C22H27NO2
Mol. Mass.337.4553
SMILESC[C@]12CC[C@H]3[C@@H](CCC4=Cc5oncc5C[C@]34C)[C@@H]1CC[C@@]2(O)C#C