Reaction Details
TargetCytochrome P450 1A2
LigandBDBM50331515
Substrate/Competitorn/a
Meas. Tech.ChEMBL_1493769 (CHEMBL3530852)
IC50 5330±n/a nM
Citation Lee, CAJones, JPKatayama, JKaspera, RJiang, YFreiwald, SSmith, EWalker, GSTotah, RA Identifying a selective substrate and inhibitor pair for the evaluation of CYP2J2 activity. Drug Metab Dispos40:943-51 (2012) 
 
Cytochrome P450 1A2
Name:Cytochrome P450 1A2
Type:Enzyme
Mol. Mass.:58423.38
Organism:Homo sapiens (Human)
Description:P05177
Residue:516
BDBM50331515
NameBDBM50331515
Synonyms:CHEMBL1708 Paroxetine hydrochloride Paxil | Paxil cr
TypeSmall organic molecule
Emp. Form.C19H20FNO3
Mol. Mass.329.3654
SMILESFc1ccc(cc1)[C@@H]1CCNC[C@H]1COc1ccc2OCOc2c1