Reaction Details
TargetCytochrome P450 2C8
LigandBDBM50423541
Substrate/Competitorn/a
Meas. Tech.ChEMBL_1493770 (CHEMBL3530853)
IC50 1950±n/a nM
Citation Lee, CAJones, JPKatayama, JKaspera, RJiang, YFreiwald, SSmith, EWalker, GSTotah, RA Identifying a selective substrate and inhibitor pair for the evaluation of CYP2J2 activity. Drug Metab Dispos40:943-51 (2012) 
 
Cytochrome P450 2C8
Name:Cytochrome P450 2C8
Type:Protein
Mol. Mass.:55839.23
Organism:Homo sapiens (Human)
Description:P10632
Residue:490
BDBM50423541
NameBDBM50423541
Synonyms:DANAZOL WIN-17757
TypeSmall organic molecule
Emp. Form.C22H27NO2
Mol. Mass.337.4553
SMILESC[C@]12CC[C@H]3[C@@H](CCC4=Cc5oncc5C[C@]34C)[C@@H]1CC[C@@]2(O)C#C