Reaction Details
TargetCytochrome P450 2C8
LigandBDBM50062614
Substrate/Competitorn/a
Meas. Tech.ChEMBL_1493770 (CHEMBL3530853)
IC50>30000±n/a nM
Citation Lee, CAJones, JPKatayama, JKaspera, RJiang, YFreiwald, SSmith, EWalker, GSTotah, RA Identifying a selective substrate and inhibitor pair for the evaluation of CYP2J2 activity. Drug Metab Dispos40:943-51 (2012) 
 
Cytochrome P450 2C8
Name:Cytochrome P450 2C8
Type:Protein
Mol. Mass.:55839.23
Organism:Homo sapiens (Human)
Description:P10632
Residue:490
BDBM50062614
NameBDBM50062614
Synonyms:CHEMBL900 Disipal N,N-dimethyl-2-(phenyl(o-tolyl)methoxy)ethanamine Norgesic Orphengesic
TypeSmall organic molecule
Emp. Form.C18H23NO
Mol. Mass.269.3813
SMILESCN(C)CCOC(c1ccccc1)c1ccccc1C