Reaction Details
TargetCytochrome P450 2J2
LigandBDBM50009859
Substrate/Competitorn/a
Meas. Tech.ChEMBL_1485701 (CHEMBL3541093)
IC50>50000±n/a nM
Citation Ren, SZeng, JMei, YZhang, JZYan, SFFei, JChen, L Discovery and characterization of novel, potent, and selective cytochrome P450 2J2 inhibitors. Drug Metab Dispos41:60-71 (2012) 
 
Cytochrome P450 2J2
Name:Cytochrome P450 2J2
Type:Enzyme
Mol. Mass.:57623.04
Organism:Homo sapiens (Human)
Description:P51589
Residue:502
BDBM50009859
NameBDBM50009859
Synonyms:(+-)-2-(p-isobutylphenyl)propionic acid (+-)-ibuprofen (4-isobutylphenyl)-alpha-methylacetic acid 2-(4-isobutylphenyl)propanoic acid 4-isobutylhydratropic acid Brufen IBUPROFEN LYSINE Ibuprofen (1) alpha-(4-isobutylphenyl)propionic acid | alpha-(p-isobutylphenyl)propionic acid
TypeSmall organic molecule
Emp. Form.C13H18O2
Mol. Mass.206.2808
SMILESCC(C)Cc1ccc(cc1)C(C)C(O)=O