Reaction Details
TargetCytochrome P450 2J2
LigandBDBM85245
Substrate/Competitorn/a
Meas. Tech.ChEMBL_1485701 (CHEMBL3541093)
IC50>50000±n/a nM
Citation Ren, SZeng, JMei, YZhang, JZYan, SFFei, JChen, L Discovery and characterization of novel, potent, and selective cytochrome P450 2J2 inhibitors. Drug Metab Dispos41:60-71 (2012) 
 
Cytochrome P450 2J2
Name:Cytochrome P450 2J2
Type:Enzyme
Mol. Mass.:57623.04
Organism:Homo sapiens (Human)
Description:P51589
Residue:502
BDBM85245
NameBDBM85245
Synonyms:CAS_36322-90-4 Piroxicam
TypeSmall organic molecule
Emp. Form.C15H13N3O4S
Mol. Mass.331.346
SMILESCN1C(C(=O)Nc2ccccn2)=C(O)c2ccccc2S1(=O)=O