Reaction Details
TargetCytochrome P450 2C19
LigandBDBM85509
Substrate/Competitorn/a
Meas. Tech.ChEMBL_1485705 (CHEMBL3541097)
IC50 28400±n/a nM
Citation Ren, SZeng, JMei, YZhang, JZYan, SFFei, JChen, L Discovery and characterization of novel, potent, and selective cytochrome P450 2J2 inhibitors. Drug Metab Dispos41:60-71 (2012) 
 
Cytochrome P450 2C19
Name:Cytochrome P450 2C19
Type:Enzyme
Mol. Mass.:55935.47
Organism:Homo sapiens (Human)
Description:P33261
Residue:490
BDBM85509
NameBDBM85509
Synonyms:CAS_55142-85-3 Ticlopidine
TypeSmall organic molecule
Emp. Form.C14H14ClNS
Mol. Mass.263.786
SMILESClc1ccccc1CN1CCc2sccc2C1