Reaction Details
TargetCytochrome P450 2J2
LigandBDBM50344942
Substrate/Competitorn/a
Meas. Tech.ChEMBL_1485701 (CHEMBL3541093)
IC50>50000±n/a nM
Citation Ren, SZeng, JMei, YZhang, JZYan, SFFei, JChen, L Discovery and characterization of novel, potent, and selective cytochrome P450 2J2 inhibitors. Drug Metab Dispos41:60-71 (2012) 
 
Cytochrome P450 2J2
Name:Cytochrome P450 2J2
Type:Enzyme
Mol. Mass.:57623.04
Organism:Homo sapiens (Human)
Description:P51589
Residue:502
BDBM50344942
NameBDBM50344942
Synonyms:CHEMBL532 ERYTHROMYCIN Erycette Erythromycin A Ilotycin | T-Stat
TypeSmall organic molecule
Emp. Form.C37H67NO13
Mol. Mass.733.9268
SMILESCC[C@H]1OC(=O)[C@H](C)[C@@H](O[C@H]2C[C@@](C)(OC)[C@@H](O)[C@H](C)O2)[C@H](C)[C@@H](O[C@@H]2O[C@H](C)C[C@@H]([C@H]2O)N(C)C)[C@](C)(O)C[C@@H](C)C(=O)[C@H](C)[C@@H](O)[C@]1(C)O