Reaction Details
TargetCytochrome P450 1A2
LigandBDBM50101971
Substrate/Competitorn/a
Meas. Tech.ChEMBL_1485706 (CHEMBL3541098)
IC50 7200±n/a nM
Citation Ren, SZeng, JMei, YZhang, JZYan, SFFei, JChen, L Discovery and characterization of novel, potent, and selective cytochrome P450 2J2 inhibitors. Drug Metab Dispos41:60-71 (2012) 
 
Cytochrome P450 1A2
Name:Cytochrome P450 1A2
Type:Enzyme
Mol. Mass.:58423.38
Organism:Homo sapiens (Human)
Description:P05177
Residue:516
BDBM50101971
NameBDBM50101971
Synonyms:BAY-E-9736 Nimodipine | Nimotop
TypeSmall organic molecule
Emp. Form.C21H26N2O7
Mol. Mass.418.4403
SMILESCOCCOC(=O)C1=C(C)NC(C)=C(C1c1cccc(c1)[N+]([O-])=O)C(=O)OC(C)C