Reaction Details
TargetCytochrome P450 2C9
LigandBDBM85509
Substrate/Competitorn/a
Meas. Tech.ChEMBL_1485704 (CHEMBL3541096)
IC50 31100±n/a nM
Citation Ren, SZeng, JMei, YZhang, JZYan, SFFei, JChen, L Discovery and characterization of novel, potent, and selective cytochrome P450 2J2 inhibitors. Drug Metab Dispos41:60-71 (2012) 
 
Cytochrome P450 2C9
Name:Cytochrome P450 2C9
Type:Enzyme
Mol. Mass.:55636.33
Organism:Homo sapiens (Human)
Description:P11712
Residue:490
BDBM85509
NameBDBM85509
Synonyms:CAS_55142-85-3 Ticlopidine
TypeSmall organic molecule
Emp. Form.C14H14ClNS
Mol. Mass.263.786
SMILESClc1ccccc1CN1CCc2sccc2C1