Reaction Details
TargetCytochrome P450 3A4
LigandBDBM79021
Substrate/Competitorn/a
Meas. Tech.ChEMBL_1485703 (CHEMBL3541095)
IC50 13600±n/a nM
Citation Ren, SZeng, JMei, YZhang, JZYan, SFFei, JChen, L Discovery and characterization of novel, potent, and selective cytochrome P450 2J2 inhibitors. Drug Metab Dispos41:60-71 (2012) 
 
Cytochrome P450 3A4
Name:Cytochrome P450 3A4
Type:Enzyme
Mol. Mass.:57349.57
Organism:Homo sapiens (Human)
Description:n/a
Residue:503
BDBM79021
NameBDBM79021
Synonyms:(1S,4S)-4-(3,4-dichlorophenyl)-N-methyl-1,2,3,4-tetrahydronaphthalen-1-amine;hydrochloride NCGC00092386 Sertraline cid_63009
TypeSmall organic molecule
Emp. Form.C17H17Cl2N
Mol. Mass.306.23
SMILESCN[C@H]1CC[C@@H](c2ccc(Cl)c(Cl)c2)c2ccccc12