Reaction Details
TargetCytochrome P450 2D6
LigandBDBM50101817
Substrate/Competitorn/a
Meas. Tech.ChEMBL_1485702 (CHEMBL3541094)
IC50>50000±n/a nM
Citation Ren, SZeng, JMei, YZhang, JZYan, SFFei, JChen, L Discovery and characterization of novel, potent, and selective cytochrome P450 2J2 inhibitors. Drug Metab Dispos41:60-71 (2012) 
 
Cytochrome P450 2D6
Name:Cytochrome P450 2D6
Type:Protein
Mol. Mass.:55774.82
Organism:Homo sapiens (Human)
Description:P10635
Residue:497
BDBM50101817
NameBDBM50101817
Synonyms:Adalat Afeditab Cr CHEBI:7565 Procardia | Procardia Xl
TypeSmall organic molecule
Emp. Form.C17H18N2O6
Mol. Mass.346.3346
SMILESCOC(=O)C1=C(C)NC(C)=C(C1c1ccccc1[N+]([O-])=O)C(=O)OC