Reaction Details
TargetCytochrome P450 1A2
LigandBDBM50103601
Substrate/Competitorn/a
Meas. Tech.ChEMBL_1485706 (CHEMBL3541098)
IC50>50000±n/a nM
Citation Ren, SZeng, JMei, YZhang, JZYan, SFFei, JChen, L Discovery and characterization of novel, potent, and selective cytochrome P450 2J2 inhibitors. Drug Metab Dispos41:60-71 (2012) 
 
Cytochrome P450 1A2
Name:Cytochrome P450 1A2
Type:Enzyme
Mol. Mass.:58423.38
Organism:Homo sapiens (Human)
Description:P05177
Residue:516
BDBM50103601
NameBDBM50103601
Synonyms:CHEBI:29007 | Ceftriaxone
TypeSmall organic molecule
Emp. Form.C18H18N8O7S3
Mol. Mass.554.58
SMILES[H][C@@]1(NC(=O)C(=N/OC)\c2csc(N)n2)C(=O)N2C(C(O)=O)=C(CSc3nc(=O)c(O)nn3C)CS[C@]12[H]