Reaction Details
TargetCytochrome P450 2J2
LigandBDBM50290811
Substrate/Competitorn/a
Meas. Tech.ChEMBL_1485701 (CHEMBL3541093)
IC50>50000±n/a nM
Citation Ren, SZeng, JMei, YZhang, JZYan, SFFei, JChen, L Discovery and characterization of novel, potent, and selective cytochrome P450 2J2 inhibitors. Drug Metab Dispos41:60-71 (2012) 
 
Cytochrome P450 2J2
Name:Cytochrome P450 2J2
Type:Enzyme
Mol. Mass.:57623.04
Organism:Homo sapiens (Human)
Description:P51589
Residue:502
BDBM50290811
NameBDBM50290811
Synonyms:5-Chloro-3H-benzooxazol-2-one 5-chlorobenzo[d]oxazol-2(3H)-one CHLORZOXAZONE Paraflex Strifon forte dsc
TypeSmall organic molecule
Emp. Form.C7H4ClNO2
Mol. Mass.169.565
SMILESClc1ccc2oc(=O)[nH]c2c1