Reaction Details
TargetCytochrome P450 2J2
LigandBDBM50130273
Substrate/Competitorn/a
Meas. Tech.ChEMBL_1485701 (CHEMBL3541093)
IC50 10600±n/a nM
Citation Ren, SZeng, JMei, YZhang, JZYan, SFFei, JChen, L Discovery and characterization of novel, potent, and selective cytochrome P450 2J2 inhibitors. Drug Metab Dispos41:60-71 (2012) 
 
Cytochrome P450 2J2
Name:Cytochrome P450 2J2
Type:Enzyme
Mol. Mass.:57623.04
Organism:Homo sapiens (Human)
Description:P51589
Residue:502
BDBM50130273
NameBDBM50130273
Synonyms:2-(4-[3-(2-chloro-10H-phenothiazin-10-yl)propyl]-1-piperazinyl)ethanol 2-{4-[3-(2-chloro-10H-phenothiazin-10-yl)propyl]piperazin-1-yl}ethanol 4-[3-(2-chlorophenothiazin-10-yl)propyl]-1-piperazineethanol Chlorpiprazine Perfenazine Trilafon | gamma-(4-(beta-hydroxyethyl)piperazin-1-yl)propyl-2-chlorophenothiazine
TypeSmall organic molecule
Emp. Form.C21H26ClN3OS
Mol. Mass.403.969
SMILESOCCN1CCN(CCCN2c3ccccc3Sc3ccc(Cl)cc23)CC1