Reaction Details
TargetDNA gyrase subunit A/B
LigandBDBM50103535
Substrate/Competitorn/a
Meas. Tech.ChEMBL_1433315 (CHEMBL3389960)
IC50 340±n/a nM
Citation Basarab, GSBrassil, PDoig, PGalullo, VHaimes, HBKern, GKutschke, AMcNulty, JSchuck, VJStone, GGowravaram, M Novel DNA gyrase inhibiting spiropyrimidinetriones with a benzisoxazole scaffold: SAR and in vivo characterization. J Med Chem57:9078-95 (2014) 
 
DNA gyrase subunit A/B
Name:DNA gyrase subunit A/B
Type:A2B2 tetramer
Mol. Mass.:n/a
Description:n/a
Components:This complex has 2 components.
Component 1
Name:DNA gyrase subunit A
Synonyms:DNA gyrase GYRA_ECOLI hisW parD
Type:Enzyme Subunit
Mol. Mass.:96935.15
Organism:Escherichia coli (strain K12)
Description:n/a
Residue:875
Component 2
Name:DNA gyrase subunit B
Synonyms:DNA gyrase subunit B GYRB_ECOLI acrB gyrB hisU parA | pcbA
Type:Enzyme Subunit
Mol. Mass.:89941.28
Organism:Escherichia coli (strain K12)
Description:P0AES6
Residue:804
BDBM50103535
NameBDBM50103535
Synonyms:CHEMBL3357988
TypeSmall organic molecule
Emp. Form.C21H21FN4O5
Mol. Mass.428.4136
SMILESCC1CN2C(C(C)O1)C1(Cc3cc4c(noc4c(F)c23)C2CC2)C(=O)NC(=O)NC1=O