Reaction Details
TargetCytochrome P450 1A2
LigandBDBM50103543
Substrate/Competitorn/a
Meas. Tech.ChEMBL_1434164 (CHEMBL3383972)
IC50>10000±n/a nM
Citation Scott, JSBowker, SSBrocklehurst, KJBrown, HSClarke, DSEaster, AErtan, AGoldberg, KHudson, JAKavanagh, SLaber, DLeach, AGMacFaul, PAMartin, EAMcKerrecher, DSchofield, PSvensson, PHTeague, J Circumventing seizure activity in a series of G protein coupled receptor 119 (GPR119) agonists. J Med Chem57:8984-98 (2014) 
 
Cytochrome P450 1A2
Name:Cytochrome P450 1A2
Type:Enzyme
Mol. Mass.:58423.38
Organism:Homo sapiens (Human)
Description:P05177
Residue:516
BDBM50103543
NameBDBM50103543
Synonyms:CHEMBL3358006
TypeSmall organic molecule
Emp. Form.C21H22F4N6O4S
Mol. Mass.530.496
SMILESC[C@@H]1CN(CCN1c1ncc(OCc2ccc(CS(C)(=O)=O)cc2F)cn1)c1nc(no1)C(F)(F)F