Reaction Details
TargetL-lactate dehydrogenase A chain
LigandBDBM50425797
Substrate/Competitorn/a
Meas. Tech.ChEMBL_1435605 (CHEMBL3386528)
IC50 120±n/a nM
Citation Granchi, CFancelli, DMinutolo, F An update on therapeutic opportunities offered by cancer glycolytic metabolism. Bioorg Med Chem Lett24:4915-25 (2014) 
 
L-lactate dehydrogenase A chain
Name:L-lactate dehydrogenase A chain
Type:Protein
Mol. Mass.:36694.85
Organism:Homo sapiens (Human)
Description:P00338::PDB Code: 4ajp
Residue:332
BDBM50425797
NameBDBM50425797
Synonyms:CHEMBL2316885
TypeSmall organic molecule
Emp. Form.C33H32ClFN4O11S
Mol. Mass.747.144
SMILESCOc1cc(OC[C@@H](O)[C@@H](O)[C@H](O)[C@H](O)CNc2cc(F)cc(c2)-c2ccc(cn2)C(O)=O)c(Cl)cc1NC(=O)CSc1ccc(cn1)C(O)=O