Reaction Details
TargetL-lactate dehydrogenase A chain
LigandBDBM50441138
Substrate/Competitorn/a
Meas. Tech.ChEMBL_1435605 (CHEMBL3386528)
IC50 500±n/a nM
Citation Granchi, CFancelli, DMinutolo, F An update on therapeutic opportunities offered by cancer glycolytic metabolism. Bioorg Med Chem Lett24:4915-25 (2014) 
 
L-lactate dehydrogenase A chain
Name:L-lactate dehydrogenase A chain
Type:Protein
Mol. Mass.:36694.85
Organism:Homo sapiens (Human)
Description:P00338::PDB Code: 4ajp
Residue:332
BDBM50441138
NameBDBM50441138
Synonyms:CHEMBL2430727
TypeSmall organic molecule
Emp. Form.C20H19ClN4O2
Mol. Mass.382.843
SMILESC[C@@H](Nc1nc(cnc1N)-c1cc(ccc1C)C(O)=O)c1ccc(Cl)cc1